Reaction Details
TargetTyrosine-protein kinase ABL1
LigandBDBM50378811
Substrate/Competitorn/a
Meas. Tech.ChEMBL_652025 (CHEMBL1227835)
Ki 20±n/a nM
Citation Kraus, GAGupta, VMokhtarian, MMehanovic, SNilsen-Hamilton, M New effective inhibitors of the Abelson kinase. Bioorg Med Chem18:6316-21 (2010) 
 
Tyrosine-protein kinase ABL1
Name:Tyrosine-protein kinase ABL1
Type:Enzyme
Mol. Mass.:122897.30
Organism:Homo sapiens (Human)
Description:P00519
Residue:1130
BDBM50378811
NameBDBM50378811
Synonyms:CHEMBL1223483
TypeSmall organic molecule
Emp. Form.C31H30Cl2N6O3S
Mol. Mass.637.579
SMILESCn1c2nc(NCc3cccc(c3)C(=O)CCCC[C@@H]3SC[C@@H]4NC(=O)N[C@H]34)ncc2cc(-c2c(Cl)cccc2Cl)c1=O