Reaction Details
TargetTyrosine-protein kinase ABL1
LigandBDBM6568
Substrate/Competitorn/a
Meas. Tech.ChEMBL_652025 (CHEMBL1227835)
Ki 0.2±n/a nM
Citation Kraus, GAGupta, VMokhtarian, MMehanovic, SNilsen-Hamilton, M New effective inhibitors of the Abelson kinase. Bioorg Med Chem18:6316-21 (2010) 
 
Tyrosine-protein kinase ABL1
Name:Tyrosine-protein kinase ABL1
Type:Enzyme
Mol. Mass.:122897.30
Organism:Homo sapiens (Human)
Description:P00519
Residue:1130
BDBM6568
NameBDBM6568
Synonyms:6-(2,6-dichlorophenyl)-8-methyl-2-{[3-(methylsulfanyl)phenyl]amino}-7H,8H-pyrido[2,3-d]pyrimidin-7-one PD-173955 US11136333, Compound PD173955
TypeSmall organic molecule
Emp. Form.C21H16Cl2N4OS
Mol. Mass.443.349
SMILESCSc1cccc(Nc2ncc3cc(-c4c(Cl)cccc4Cl)c(=O)n(C)c3n2)c1