Reaction Details
TargetSodium-dependent serotonin transporter
LigandBDBM30130
Substrate/Competitorn/a
Meas. Tech.ChEMBL_654117 (CHEMBL1228923)
IC50 3.1±n/a nM
Citation Lee, KHPark, CEMin, KHShin, YJChung, CMKim, HHYoon, HJWon-Kim, naRyu, EJShin, YJNam, HSCho, JWLee, HY Synthesis and pharmacological evaluation of 3-aryl-3-azolylpropan-1-amines as selective triple serotonin/norepinephrine/dopamine reuptake inhibitors. Bioorg Med Chem Lett20:5567-71 (2010) 
 
Sodium-dependent serotonin transporter
Name:Sodium-dependent serotonin transporter
Type:Multi-pass membrane protein
Mol. Mass.:70322.51
Organism:Homo sapiens (Human)
Description:P31645
Residue:630
BDBM30130
NameBDBM30130
Synonyms:CHEMBL1201082 Fluoxetin Prozac cid_62857
TypeSmall organic molecule
Emp. Form.C17H18F3NO
Mol. Mass.309.3261
SMILESCNCCC(Oc1ccc(cc1)C(F)(F)F)c1ccccc1