Reaction Details
TargetDNA topoisomerase 1
LigandBDBM50326190
Substrate/Competitorn/a
Meas. Tech.ChEMBL_659083 (CHEMBL1246696)
IC50>100000±n/a nM
Citation Tseng, CHTzeng, CCYang, CLLu, PJChen, HLLi, HYChuang, YCYang, CNChen, YL Synthesis and antiproliferative evaluation of certain indeno[1,2-c]quinoline derivatives. Part 2. J Med Chem53:6164-79 (2010) 
 
DNA topoisomerase 1
Name:DNA topoisomerase 1
Type:Enzyme
Mol. Mass.:90771.02
Organism:Homo sapiens (Human)
Description:P11387
Residue:765
BDBM50326190
NameBDBM50326190
Synonyms:(E)-6-Hydroxy-9-methoxy-11H-indeno[1,2-c]quinolin-11-one O-2-Morpholinoethyl Oxime | CHEMBL1243264
TypeSmall organic molecule
Emp. Form.C23H23N3O4
Mol. Mass.405.4464
SMILESCOc1ccc-2c(c1)\C(=N/OCCN1CCOCC1)c1c-2c(=O)[nH]c2ccccc12