Reaction Details
TargetDNA topoisomerase 1
LigandBDBM50326195
Substrate/Competitorn/a
Meas. Tech.ChEMBL_659083 (CHEMBL1246696)
IC50 13000±n/a nM
Citation Tseng, CHTzeng, CCYang, CLLu, PJChen, HLLi, HYChuang, YCYang, CNChen, YL Synthesis and antiproliferative evaluation of certain indeno[1,2-c]quinoline derivatives. Part 2. J Med Chem53:6164-79 (2010) 
 
DNA topoisomerase 1
Name:DNA topoisomerase 1
Type:Enzyme
Mol. Mass.:90771.02
Organism:Homo sapiens (Human)
Description:P11387
Residue:765
BDBM50326195
NameBDBM50326195
Synonyms:(E)-9-methoxy-6-(piperazin-1-yl)-11H-indeno[1,2-c]quinolin-11-one O-2-morpholinoethyl oxime | CHEMBL1243355
TypeSmall organic molecule
Emp. Form.C27H31N5O3
Mol. Mass.473.5667
SMILESCOc1ccc-2c(c1)\C(=N/OCCN1CCOCC1)c1c-2c(nc2ccccc12)N1CCNCC1