Reaction Details
Target5-hydroxytryptamine receptor 3A
LigandBDBM50326218
Substrate/Competitorn/a
Meas. Tech.ChEMBL_659608 (CHEMBL1249042)
Ki<1000±n/a nM
Citation Sams, AGHentzer, MMikkelsen, GKLarsen, KBundgaard, CPlath, NChristoffersen, CTBang-Andersen, B Discovery of N-{1-[3-(3-oxo-2,3-dihydrobenzo[1,4]oxazin-4-yl)propyl]piperidin-4-yl}-2-phenylacetamide (Lu AE51090): an allosteric muscarinic M1 receptor agonist with unprecedented selectivity and procognitive potential. J Med Chem53:6386-97 (2010) 
 
5-hydroxytryptamine receptor 3A
Name:5-hydroxytryptamine receptor 3A
Type:Protein
Mol. Mass.:55283.27
Organism:Homo sapiens (Human)
Description:P46098
Residue:478
BDBM50326218
NameBDBM50326218
Synonyms:CHEMBL1242923 | N-{1-[3-(3-Oxo-2,3-dihydrobenzo[1,4]oxazin-4-yl)propyl]-piperidin-4-yl}-2-phenylacetamide
TypeSmall organic molecule
Emp. Form.C24H29N3O3
Mol. Mass.407.5054
SMILESO=C(Cc1ccccc1)NC1CCN(CCCN2C(=O)COc3ccccc23)CC1