Reaction Details
TargetMuscarinic acetylcholine receptor M1
LigandBDBM50326229
Substrate/Competitorn/a
Meas. Tech.ChEMBL_659441 (CHEMBL1248351)
EC50 86±n/a nM
Citation Sams, AGHentzer, MMikkelsen, GKLarsen, KBundgaard, CPlath, NChristoffersen, CTBang-Andersen, B Discovery of N-{1-[3-(3-oxo-2,3-dihydrobenzo[1,4]oxazin-4-yl)propyl]piperidin-4-yl}-2-phenylacetamide (Lu AE51090): an allosteric muscarinic M1 receptor agonist with unprecedented selectivity and procognitive potential. J Med Chem53:6386-97 (2010) 
 
Muscarinic acetylcholine receptor M1
Name:Muscarinic acetylcholine receptor M1
Type:Protein
Mol. Mass.:51442.54
Organism:Homo sapiens (Human)
Description:P11229
Residue:460
BDBM50326229
NameBDBM50326229
Synonyms:CHEMBL1242924 | N-{1-[3-(6,7-Difluoro-2-oxo-3,4-dihydro-2H-quinolin-1-yl)-propyl]-piperidin-4-yl}-acetamide
TypeSmall organic molecule
Emp. Form.C19H25F2N3O2
Mol. Mass.365.4175
SMILESCC(=O)NC1CCN(CCCN2C(=O)CCc3cc(F)c(F)cc23)CC1