Reaction Details
TargetMuscarinic acetylcholine receptor M5
LigandBDBM50263887
Substrate/Competitorn/a
Meas. Tech.ChEMBL_659452 (CHEMBL1248362)
Ki 940±n/a nM
Citation Sams, AGHentzer, MMikkelsen, GKLarsen, KBundgaard, CPlath, NChristoffersen, CTBang-Andersen, B Discovery of N-{1-[3-(3-oxo-2,3-dihydrobenzo[1,4]oxazin-4-yl)propyl]piperidin-4-yl}-2-phenylacetamide (Lu AE51090): an allosteric muscarinic M1 receptor agonist with unprecedented selectivity and procognitive potential. J Med Chem53:6386-97 (2010) 
 
Muscarinic acetylcholine receptor M5
Name:Muscarinic acetylcholine receptor M5
Type:PROTEIN
Mol. Mass.:60102.35
Organism:Homo sapiens (Human)
Description:ChEMBL_1517990
Residue:532
BDBM50263887
NameBDBM50263887
Synonyms:1-(1'-(2-methylbenzyl)-1,4'-bipiperidin-4-yl)-1H-benzo[d]imidazol-2(3H)-one CHEMBL522460
TypeSmall organic molecule
Emp. Form.C25H32N4O
Mol. Mass.404.5478
SMILESCc1ccccc1CN1CCC(CC1)N1CCC(CC1)n1c2ccccc2[nH]c1=O