Reaction Details
TargetCyclin-dependent kinase 1
LigandBDBM50378822
Substrate/Competitorn/a
Meas. Tech.ChEMBL_660572 (CHEMBL1250280)
IC50 104±n/a nM
Citation Sridhar, JAkula, NPattabiraman, N Selectivity and potency of cyclin-dependent kinase inhibitors. AAPS J8:204-21 (2006) 
 
Cyclin-dependent kinase 1
Name:Cyclin-dependent kinase 1
Type:Enzyme Subunit
Mol. Mass.:34101.08
Organism:Homo sapiens (Human)
Description:P06493
Residue:297
BDBM50378822
NameBDBM50378822
Synonyms:CHEMBL1241662
TypeSmall organic molecule
Emp. Form.C21H13ClF3N3O
Mol. Mass.415.796
SMILESNc1nc2ccc(cc2n1Cc1c(F)cccc1F)C(=O)c1c(F)cccc1Cl