Reaction Details
TargetCyclin-dependent kinase 4
LigandBDBM50378819
Substrate/Competitorn/a
Meas. Tech.ChEMBL_660568 (CHEMBL1250276)
IC50 150±n/a nM
Citation Sridhar, JAkula, NPattabiraman, N Selectivity and potency of cyclin-dependent kinase inhibitors. AAPS J8:204-21 (2006) 
 
Cyclin-dependent kinase 4
Name:Cyclin-dependent kinase 4
Type:Enzyme Subunit
Mol. Mass.:33731.96
Organism:Homo sapiens (Human)
Description:P11802
Residue:303
BDBM50378819
NameBDBM50378819
Synonyms:CHEMBL1241566
TypeSmall organic molecule
Emp. Form.C17H15FN4O2S
Mol. Mass.358.39
SMILESCc1ccc(F)c(Nc2nccc(n2)-c2ccc(cc2)S(N)(=O)=O)c1