Reaction Details
TargetCyclin-dependent kinase 2
LigandBDBM50192076
Substrate/Competitorn/a
Meas. Tech.ChEMBL_660573 (CHEMBL1250281)
IC50 78±n/a nM
Citation Sridhar, JAkula, NPattabiraman, N Selectivity and potency of cyclin-dependent kinase inhibitors. AAPS J8:204-21 (2006) 
 
Cyclin-dependent kinase 2
Name:Cyclin-dependent kinase 2
Type:Enzyme Subunit
Mol. Mass.:33938.17
Organism:Homo sapiens (Human)
Description:P24941
Residue:298
BDBM50192076
NameBDBM50192076
Synonyms:1-{5-[((S)-5-chloro-indan-2-ylamino)-methyl]-1H-pyrazol-3-yl}-3-((S)-5-oxo-2,3,5,9b-tetrahydro-1H-pyrrolo[2,1-a]isoindol-9-yl)-urea CHEMBL336242
TypeSmall organic molecule
Emp. Form.C25H25ClN6O2
Mol. Mass.476.958
SMILESClc1ccc2C[C@@H](Cc2c1)NCc1cc(NC(=O)Nc2cccc3C(=O)N4CCC[C@H]4c23)[nH]n1