Reaction Details
TargetGalectin-7
LigandBDBM50326603
Substrate/Competitorn/a
Meas. Tech.ChEMBL_661836 (CHEMBL1252152)
Kd 2800000±n/a nM
Citation Salameh, BACumpstey, ISundin, ALeffler, HNilsson, UJ 1H-1,2,3-triazol-1-yl thiodigalactoside derivatives as high affinity galectin-3 inhibitors. Bioorg Med Chem18:5367-78 (2010) 
 
Galectin-7
Name:Galectin-7
Type:Galactoside-binding protein
Mol. Mass.:15077.89
Organism:Homo sapiens (Human)
Description:n/a
Residue:136
BDBM50326603
NameBDBM50326603
Synonyms:CHEMBL1254600 | Methyl-3-deoxy-3-(4-(3-methoxyphenyl)-1H-[1,2,3]-triazol-1-yl)-1-thio-beta-D-galactopyranoside
TypeSmall organic molecule
Emp. Form.C16H21N3O5S
Mol. Mass.367.42
SMILESCOc1cccc(c1)-c1cn(nn1)[C@H]1[C@@H](O)[C@@H](CO)O[C@@H](SC)[C@@H]1O