Reaction Details
TargetGalectin-7
LigandBDBM50326605
Substrate/Competitorn/a
Meas. Tech.ChEMBL_661836 (CHEMBL1252152)
Kd>2000000±n/a nM
Citation Salameh, BACumpstey, ISundin, ALeffler, HNilsson, UJ 1H-1,2,3-triazol-1-yl thiodigalactoside derivatives as high affinity galectin-3 inhibitors. Bioorg Med Chem18:5367-78 (2010) 
 
Galectin-7
Name:Galectin-7
Type:Galactoside-binding protein
Mol. Mass.:15077.89
Organism:Homo sapiens (Human)
Description:n/a
Residue:136
BDBM50326605
NameBDBM50326605
Synonyms:CHEMBL1254676 | Methyl-3-deoxy-3-(4-(2-fluorophenyl)-1H-[1,2,3]-triazol-1-yl)-1-thio-beta-D-galactopyranoside
TypeSmall organic molecule
Emp. Form.C15H18FN3O4S
Mol. Mass.355.385
SMILESCS[C@@H]1O[C@H](CO)[C@H](O)[C@@H]([C@H]1O)n1cc(nn1)-c1ccccc1F