Reaction Details
TargetGalectin-8
LigandBDBM50326595
Substrate/Competitorn/a
Meas. Tech.ChEMBL_661837 (CHEMBL1252153)
Kd 20000±n/a nM
Citation Salameh, BACumpstey, ISundin, ALeffler, HNilsson, UJ 1H-1,2,3-triazol-1-yl thiodigalactoside derivatives as high affinity galectin-3 inhibitors. Bioorg Med Chem18:5367-78 (2010) 
 
Galectin-8
Name:Galectin-8
Type:PROTEIN
Mol. Mass.:35814.23
Organism:Homo sapiens (Human)
Description:ChEMBL_1454625
Residue:317
BDBM50326595
NameBDBM50326595
Synonyms:CHEMBL1253726 | Di-(3-deoxy-3-(4-((2-phenylethylamino)carbonyl)-1H-1,2,3-triazol-1-yl)-beta-D-galactopyranosyl)sulfane
TypeSmall organic molecule
Emp. Form.C34H42N8O10S
Mol. Mass.754.81
SMILESOC[C@H]1O[C@@H](S[C@@H]2O[C@H](CO)[C@H](O)[C@@H]([C@H]2O)n2cc(nn2)C(=O)NCCc2ccccc2)[C@H](O)[C@H]([C@H]1O)n1cc(nn1)C(=O)NCCc1ccccc1