Reaction Details
TargetGalectin-8
LigandBDBM50326596
Substrate/Competitorn/a
Meas. Tech.ChEMBL_661837 (CHEMBL1252153)
Kd 66000±n/a nM
Citation Salameh, BACumpstey, ISundin, ALeffler, HNilsson, UJ 1H-1,2,3-triazol-1-yl thiodigalactoside derivatives as high affinity galectin-3 inhibitors. Bioorg Med Chem18:5367-78 (2010) 
 
Galectin-8
Name:Galectin-8
Type:PROTEIN
Mol. Mass.:35814.23
Organism:Homo sapiens (Human)
Description:ChEMBL_1454625
Residue:317
BDBM50326596
NameBDBM50326596
Synonyms:CHEMBL1253187 | Di-(3-deoxy-3-(4-((allylamino)carbonyl)-1H-1,2,3-triazol-1-yl)-beta-D-galactopyranosyl)sulfane
TypeSmall organic molecule
Emp. Form.C24H34N8O10S
Mol. Mass.626.639
SMILESOC[C@H]1O[C@@H](S[C@@H]2O[C@H](CO)[C@H](O)[C@@H]([C@H]2O)n2cc(nn2)C(=O)NCC=C)[C@H](O)[C@H]([C@H]1O)n1cc(nn1)C(=O)NCC=C