Reaction Details
TargetGalectin-8
LigandBDBM50077225
Substrate/Competitorn/a
Meas. Tech.ChEMBL_661837 (CHEMBL1252153)
Kd 61000±n/a nM
Citation Salameh, BACumpstey, ISundin, ALeffler, HNilsson, UJ 1H-1,2,3-triazol-1-yl thiodigalactoside derivatives as high affinity galectin-3 inhibitors. Bioorg Med Chem18:5367-78 (2010) 
 
Galectin-8
Name:Galectin-8
Type:PROTEIN
Mol. Mass.:35814.23
Organism:Homo sapiens (Human)
Description:ChEMBL_1454625
Residue:317
BDBM50077225
NameBDBM50077225
Synonyms:(2R,3R,4S,5R,6S)-2-(hydroxymethyl)-6-{[(2S,3R,4S,5R,6R)-3,4,5-trihydroxy-6-(hydroxymethyl)tetrahydro-2H-pyran-2-yl]thio}tetrahydro-2H-pyran-3,4,5-triol THIODIGALACTOSIDE
TypeSmall organic molecule
Emp. Form.C12H22O10S
Mol. Mass.358.362
SMILESOC[C@H]1O[C@@H](S[C@@H]2O[C@H](CO)[C@H](O)[C@H](O)[C@H]2O)[C@H](O)[C@@H](O)[C@H]1O