Reaction Details
TargetGalectin-8
LigandBDBM50326599
Substrate/Competitorn/a
Meas. Tech.ChEMBL_661837 (CHEMBL1252153)
Kd>100000±n/a nM
Citation Salameh, BACumpstey, ISundin, ALeffler, HNilsson, UJ 1H-1,2,3-triazol-1-yl thiodigalactoside derivatives as high affinity galectin-3 inhibitors. Bioorg Med Chem18:5367-78 (2010) 
 
Galectin-8
Name:Galectin-8
Type:PROTEIN
Mol. Mass.:35814.23
Organism:Homo sapiens (Human)
Description:ChEMBL_1454625
Residue:317
BDBM50326599
NameBDBM50326599
Synonyms:CHEMBL1254013 | Methyl-3'-naphthyl-2-amido-Lactoe-N-Acyl
TypeSmall organic molecule
Emp. Form.C26H34N2O11
Mol. Mass.550.555
SMILESCO[C@@H]1O[C@H](CO)[C@@H](O[C@@H]2O[C@H](CO)[C@H](O)[C@H](NC(=O)c3ccc4ccccc4c3)[C@H]2O)[C@H](O)[C@H]1NC(C)=O