Reaction Details
TargetEpidermal growth factor receptor
LigandBDBM50271906
Substrate/Competitorn/a
Meas. Tech.ChEMBL_661840 (CHEMBL1252156)
IC50 1670±n/a nM
Citation Gangjee, AZhao, YRaghavan, SIhnat, MADisch, BC Design, synthesis and evaluation of 2-amino-4-m-bromoanilino-6-arylmethyl-7H-pyrrolo[2,3-d]pyrimidines as tyrosine kinase inhibitors and antiangiogenic agents. Bioorg Med Chem18:5261-73 (2010) 
 
Epidermal growth factor receptor
Name:Epidermal growth factor receptor
Type:Receptor Kinase Domain
Mol. Mass.:134279.59
Organism:Homo sapiens (Human)
Description:P00533
Residue:1210
BDBM50271906
NameBDBM50271906
Synonyms:2-benzyl-N4-(3-bromophenyl)-1H-indole-4,6-diamine CHEMBL499344
TypeSmall organic molecule
Emp. Form.C19H16BrN5
Mol. Mass.394.268
SMILESNc1nc(Nc2cccc(Br)c2)c2cc(Cc3ccccc3)[nH]c2n1