Reaction Details
TargetEpidermal growth factor receptor
LigandBDBM50326610
Substrate/Competitorn/a
Meas. Tech.ChEMBL_661840 (CHEMBL1252156)
IC50>200000±n/a nM
Citation Gangjee, AZhao, YRaghavan, SIhnat, MADisch, BC Design, synthesis and evaluation of 2-amino-4-m-bromoanilino-6-arylmethyl-7H-pyrrolo[2,3-d]pyrimidines as tyrosine kinase inhibitors and antiangiogenic agents. Bioorg Med Chem18:5261-73 (2010) 
 
Epidermal growth factor receptor
Name:Epidermal growth factor receptor
Type:Receptor Kinase Domain
Mol. Mass.:134279.59
Organism:Homo sapiens (Human)
Description:P00533
Residue:1210
BDBM50326610
NameBDBM50326610
Synonyms:2-Amino-4-(m-bromoanilino)-6-benzyl-7-methyl-pyrrolo-[2,3-d]pyrimidine | CHEMBL1254285
TypeSmall organic molecule
Emp. Form.C20H18BrN5
Mol. Mass.408.294
SMILESCn1c(Cc2ccccc2)cc2c(Nc3cccc(Br)c3)nc(N)nc12