Reaction Details
TargetEpidermal growth factor receptor
LigandBDBM50326614
Substrate/Competitorn/a
Meas. Tech.ChEMBL_661840 (CHEMBL1252156)
IC50 1200±n/a nM
Citation Gangjee, AZhao, YRaghavan, SIhnat, MADisch, BC Design, synthesis and evaluation of 2-amino-4-m-bromoanilino-6-arylmethyl-7H-pyrrolo[2,3-d]pyrimidines as tyrosine kinase inhibitors and antiangiogenic agents. Bioorg Med Chem18:5261-73 (2010) 
 
Epidermal growth factor receptor
Name:Epidermal growth factor receptor
Type:Receptor Kinase Domain
Mol. Mass.:134279.59
Organism:Homo sapiens (Human)
Description:P00533
Residue:1210
BDBM50326614
NameBDBM50326614
Synonyms:2-Amino-4-(N-methyl-m-bromoanilino)-6-(2-methylbenzyl)-7-methyl-pyrrolo[2,3-d]pyrimidine | CHEMBL1254443
TypeSmall organic molecule
Emp. Form.C22H22BrN5
Mol. Mass.436.348
SMILESCN(c1cccc(Br)c1)c1nc(N)nc2n(C)c(Cc3ccccc3C)cc12