Reaction Details
TargetEpidermal growth factor receptor
LigandBDBM50326615
Substrate/Competitorn/a
Meas. Tech.ChEMBL_661840 (CHEMBL1252156)
IC50 143500±n/a nM
Citation Gangjee, AZhao, YRaghavan, SIhnat, MADisch, BC Design, synthesis and evaluation of 2-amino-4-m-bromoanilino-6-arylmethyl-7H-pyrrolo[2,3-d]pyrimidines as tyrosine kinase inhibitors and antiangiogenic agents. Bioorg Med Chem18:5261-73 (2010) 
 
Epidermal growth factor receptor
Name:Epidermal growth factor receptor
Type:Receptor Kinase Domain
Mol. Mass.:134279.59
Organism:Homo sapiens (Human)
Description:P00533
Residue:1210
BDBM50326615
NameBDBM50326615
Synonyms:2-Amino-4-(N-methyl-m-bromoanilino)-6-(2,5-dimethoxybenzyl)-pyrrolo[2,3-d]pyrimidine | CHEMBL1254444
TypeSmall organic molecule
Emp. Form.C22H22BrN5O2
Mol. Mass.468.346
SMILESCOc1ccc(OC)c(Cc2cc3c(nc(N)nc3[nH]2)N(C)c2cccc(Br)c2)c1