Reaction Details
TargetVascular endothelial growth factor receptor 2
LigandBDBM50271906
Substrate/Competitorn/a
Meas. Tech.ChEMBL_661841 (CHEMBL1252157)
IC50>50000±n/a nM
Citation Gangjee, AZhao, YRaghavan, SIhnat, MADisch, BC Design, synthesis and evaluation of 2-amino-4-m-bromoanilino-6-arylmethyl-7H-pyrrolo[2,3-d]pyrimidines as tyrosine kinase inhibitors and antiangiogenic agents. Bioorg Med Chem18:5261-73 (2010) 
 
Vascular endothelial growth factor receptor 2
Name:Vascular endothelial growth factor receptor 2
Type:Receptor Tyrosine Kinase
Mol. Mass.:151510.97
Organism:Homo sapiens (Human)
Description:P35968
Residue:1356
BDBM50271906
NameBDBM50271906
Synonyms:2-benzyl-N4-(3-bromophenyl)-1H-indole-4,6-diamine CHEMBL499344
TypeSmall organic molecule
Emp. Form.C19H16BrN5
Mol. Mass.394.268
SMILESNc1nc(Nc2cccc(Br)c2)c2cc(Cc3ccccc3)[nH]c2n1