Reaction Details
TargetVascular endothelial growth factor receptor 2
LigandBDBM50318183
Substrate/Competitorn/a
Meas. Tech.ChEMBL_661841 (CHEMBL1252157)
IC50 620±n/a nM
Citation Gangjee, AZhao, YRaghavan, SIhnat, MADisch, BC Design, synthesis and evaluation of 2-amino-4-m-bromoanilino-6-arylmethyl-7H-pyrrolo[2,3-d]pyrimidines as tyrosine kinase inhibitors and antiangiogenic agents. Bioorg Med Chem18:5261-73 (2010) 
 
Vascular endothelial growth factor receptor 2
Name:Vascular endothelial growth factor receptor 2
Type:Receptor Tyrosine Kinase
Mol. Mass.:151510.97
Organism:Homo sapiens (Human)
Description:P35968
Residue:1356
BDBM50318183
NameBDBM50318183
Synonyms:CHEMBL1095465 | N4-(3-bromophenyl)-6-(2,5-dimethoxybenzyl)-7H-pyrrolo[2,3-d]pyrimidine-2,4-diamine
TypeSmall organic molecule
Emp. Form.C21H20BrN5O2
Mol. Mass.454.32
SMILESCOc1ccc(OC)c(Cc2cc3c(Nc4cccc(Br)c4)nc(N)nc3[nH]2)c1