Reaction Details
TargetVascular endothelial growth factor receptor 2
LigandBDBM50326612
Substrate/Competitorn/a
Meas. Tech.ChEMBL_661841 (CHEMBL1252157)
IC50>200000±n/a nM
Citation Gangjee, AZhao, YRaghavan, SIhnat, MADisch, BC Design, synthesis and evaluation of 2-amino-4-m-bromoanilino-6-arylmethyl-7H-pyrrolo[2,3-d]pyrimidines as tyrosine kinase inhibitors and antiangiogenic agents. Bioorg Med Chem18:5261-73 (2010) 
 
Vascular endothelial growth factor receptor 2
Name:Vascular endothelial growth factor receptor 2
Type:Receptor Tyrosine Kinase
Mol. Mass.:151510.97
Organism:Homo sapiens (Human)
Description:P35968
Residue:1356
BDBM50326612
NameBDBM50326612
Synonyms:2-Amino-4-(N-methyl-m-bromoanilino)-6-(2-methylbenzyl)-pyrrolo[2,3-d]pyrimidine | CHEMBL1254363
TypeSmall organic molecule
Emp. Form.C21H20BrN5
Mol. Mass.422.321
SMILESCN(c1cccc(Br)c1)c1nc(N)nc2[nH]c(Cc3ccccc3C)cc12