Reaction Details
TargetVascular endothelial growth factor receptor 2
LigandBDBM50326613
Substrate/Competitorn/a
Meas. Tech.ChEMBL_661841 (CHEMBL1252157)
IC50 116300±n/a nM
Citation Gangjee, AZhao, YRaghavan, SIhnat, MADisch, BC Design, synthesis and evaluation of 2-amino-4-m-bromoanilino-6-arylmethyl-7H-pyrrolo[2,3-d]pyrimidines as tyrosine kinase inhibitors and antiangiogenic agents. Bioorg Med Chem18:5261-73 (2010) 
 
Vascular endothelial growth factor receptor 2
Name:Vascular endothelial growth factor receptor 2
Type:Receptor Tyrosine Kinase
Mol. Mass.:151510.97
Organism:Homo sapiens (Human)
Description:P35968
Residue:1356
BDBM50326613
NameBDBM50326613
Synonyms:2-Amino-4-(m-bromoanilino)-6-(2-methylbenzyl)-7-methyl-pyrrolo[2,3-d]pyrimidine | CHEMBL1254364
TypeSmall organic molecule
Emp. Form.C21H20BrN5
Mol. Mass.422.321
SMILESCc1ccccc1Cc1cc2c(Nc3cccc(Br)c3)nc(N)nc2n1C