Reaction Details
TargetVascular endothelial growth factor receptor 2
LigandBDBM50326617
Substrate/Competitorn/a
Meas. Tech.ChEMBL_661841 (CHEMBL1252157)
IC50>200000±n/a nM
Citation Gangjee, AZhao, YRaghavan, SIhnat, MADisch, BC Design, synthesis and evaluation of 2-amino-4-m-bromoanilino-6-arylmethyl-7H-pyrrolo[2,3-d]pyrimidines as tyrosine kinase inhibitors and antiangiogenic agents. Bioorg Med Chem18:5261-73 (2010) 
 
Vascular endothelial growth factor receptor 2
Name:Vascular endothelial growth factor receptor 2
Type:Receptor Tyrosine Kinase
Mol. Mass.:151510.97
Organism:Homo sapiens (Human)
Description:P35968
Residue:1356
BDBM50326617
NameBDBM50326617
Synonyms:2-Amino-4-(N-methyl-m-bromoanilino)-6-(2,5-dimethoxybenzyl)-7-methyl-pyrrolo[2,3-d]pyrimidine | CHEMBL1254523
TypeSmall organic molecule
Emp. Form.C23H24BrN5O2
Mol. Mass.482.373
SMILESCOc1ccc(OC)c(Cc2cc3c(nc(N)nc3n2C)N(C)c2cccc(Br)c2)c1