Reaction Details
TargetMu-type opioid receptor
LigandBDBM50326659
Substrate/Competitorn/a
Meas. Tech.ChEMBL_662058 (CHEMBL1251790)
Ki 1.15±n/a nM
Citation Schuster, DSpetea, MMusic, MRief, SFink, MKirchmair, JSchütz, JWolber, GLanger, TStuppner, HSchmidhammer, HRollinger, JM Morphinans and isoquinolines: acetylcholinesterase inhibition, pharmacophore modeling, and interaction with opioid receptors. Bioorg Med Chem18:5071-80 (2010) 
 
Mu-type opioid receptor
Name:Mu-type opioid receptor
Type:G Protein-Coupled Receptor (GPCR)
Mol. Mass.:44503.11
Organism:Rattus norvegicus (rat)
Description:Competition binding assays were carried out using membrane preparations from transfected HN9.10 cells that constitutively expressed the mu opioid receptor.
Residue:398
BDBM50326659
NameBDBM50326659
Synonyms:3,10-dimethoxy-17-methyl-(10S)-17-azatetracyclo[7.5.3.01,10.02,7]heptadeca-2(7),3,5-trien-13-one CHEMBL606644
TypeSmall organic molecule
Emp. Form.C19H25NO3
Mol. Mass.315.4067
SMILESCOc1cccc2C[C@H]3N(C)CC[C@@]4(CC(=O)CC[C@@]34OC)c12