Reaction Details
TargetMu-type opioid receptor
LigandBDBM50326663
Substrate/Competitorn/a
Meas. Tech.ChEMBL_662058 (CHEMBL1251790)
Ki 0.1±n/a nM
Citation Schuster, DSpetea, MMusic, MRief, SFink, MKirchmair, JSchütz, JWolber, GLanger, TStuppner, HSchmidhammer, HRollinger, JM Morphinans and isoquinolines: acetylcholinesterase inhibition, pharmacophore modeling, and interaction with opioid receptors. Bioorg Med Chem18:5071-80 (2010) 
 
Mu-type opioid receptor
Name:Mu-type opioid receptor
Type:G Protein-Coupled Receptor (GPCR)
Mol. Mass.:44503.11
Organism:Rattus norvegicus (rat)
Description:Competition binding assays were carried out using membrane preparations from transfected HN9.10 cells that constitutively expressed the mu opioid receptor.
Residue:398
BDBM50326663
NameBDBM50326663
Synonyms:CHEMBL1255022
TypeSmall organic molecule
Emp. Form.C20H25NO4
Mol. Mass.343.4168
SMILESCCO[C@]12CCC(=O)[C@]3(C)Oc4c5c(C[C@H]1N(C)CC[C@@]235)ccc4O