Reaction Details
TargetMu-type opioid receptor
LigandBDBM50326661
Substrate/Competitorn/a
Meas. Tech.ChEMBL_662058 (CHEMBL1251790)
Ki 0.46±n/a nM
Citation Schuster, DSpetea, MMusic, MRief, SFink, MKirchmair, JSchütz, JWolber, GLanger, TStuppner, HSchmidhammer, HRollinger, JM Morphinans and isoquinolines: acetylcholinesterase inhibition, pharmacophore modeling, and interaction with opioid receptors. Bioorg Med Chem18:5071-80 (2010) 
 
Mu-type opioid receptor
Name:Mu-type opioid receptor
Type:G Protein-Coupled Receptor (GPCR)
Mol. Mass.:44503.11
Organism:Rattus norvegicus (rat)
Description:Competition binding assays were carried out using membrane preparations from transfected HN9.10 cells that constitutively expressed the mu opioid receptor.
Residue:398
BDBM50326661
NameBDBM50326661
Synonyms:CHEMBL1254018 | CHEMBL1254291
TypeSmall organic molecule
Emp. Form.C17H19NO4
Mol. Mass.301.3371
SMILESOc1ccc(O)c2c1C[C@@H]1[C@@H]3CCC(=O)C[C@]23CCN1C=O