Reaction Details
TargetDelta-type opioid receptor
LigandBDBM50326657
Substrate/Competitorn/a
Meas. Tech.ChEMBL_662059 (CHEMBL1251791)
Ki 217±n/a nM
Citation Schuster, DSpetea, MMusic, MRief, SFink, MKirchmair, JSchütz, JWolber, GLanger, TStuppner, HSchmidhammer, HRollinger, JM Morphinans and isoquinolines: acetylcholinesterase inhibition, pharmacophore modeling, and interaction with opioid receptors. Bioorg Med Chem18:5071-80 (2010) 
 
Delta-type opioid receptor
Name:Delta-type opioid receptor
Type:G Protein-Coupled Receptor (GPCR)
Mol. Mass.:40465.04
Organism:Rattus norvegicus (rat)
Description:Competition binding assays were using CHO-K1 cell membranes expressing the opioid receptor.
Residue:372
BDBM50326657
NameBDBM50326657
Synonyms:CHEMBL1253927
TypeSmall organic molecule
Emp. Form.C20H25NO2
Mol. Mass.311.418
SMILESCOc1cccc2C[C@@H]3[C@@H]4CCC(=O)C[C@]4(CCN3CC=C)c12