Reaction Details
TargetDelta-type opioid receptor
LigandBDBM50326658
Substrate/Competitorn/a
Meas. Tech.ChEMBL_662059 (CHEMBL1251791)
Ki 316±n/a nM
Citation Schuster, DSpetea, MMusic, MRief, SFink, MKirchmair, JSchütz, JWolber, GLanger, TStuppner, HSchmidhammer, HRollinger, JM Morphinans and isoquinolines: acetylcholinesterase inhibition, pharmacophore modeling, and interaction with opioid receptors. Bioorg Med Chem18:5071-80 (2010) 
 
Delta-type opioid receptor
Name:Delta-type opioid receptor
Type:G Protein-Coupled Receptor (GPCR)
Mol. Mass.:40465.04
Organism:Rattus norvegicus (rat)
Description:Competition binding assays were using CHO-K1 cell membranes expressing the opioid receptor.
Residue:372
BDBM50326658
NameBDBM50326658
Synonyms:CHEMBL1253928
TypeSmall organic molecule
Emp. Form.C19H25NO3
Mol. Mass.315.4067
SMILESCCO[C@@]12CCC(=O)C[C@@]11CCN(C)[C@@H]2Cc2cccc(O)c12