Reaction Details
TargetGlucocorticoid receptor
LigandBDBM50326936
Substrate/Competitorn/a
Meas. Tech.ChEMBL_663368 (CHEMBL1250864)
IC50 7.3±n/a nM
Citation Riether, DHarcken, CRazavi, HKuzmich, DGilmore, TBentzien, JPack, EJSouza, DNelson, RMKukulka, AFadra, TNZuvela-Jelaska, LPelletier, JDinallo, RPanzenbeck, MTorcellini, CNabozny, GHThomson, DS Nonsteroidal dissociated glucocorticoid agonists containing azaindoles as steroid A-ring mimetics. J Med Chem53:6681-98 (2010) 
 
Glucocorticoid receptor
Name:Glucocorticoid receptor
Type:Enzyme
Mol. Mass.:85656.87
Organism:Homo sapiens (Human)
Description:P04150
Residue:777
BDBM50326936
NameBDBM50326936
Synonyms:1,1,1-Trifluoro-4-(5-fluoro-2-methoxyphenyl)-4-methyl-2-(1H-pyrrolo[3,2-c]pyridin-2-ylmethyl)pentan-2-ol | CHEMBL1254735
TypeSmall organic molecule
Emp. Form.C21H22F4N2O2
Mol. Mass.410.4052
SMILESCOc1ccc(F)cc1C(C)(C)CC(O)(Cc1cc2cnccc2[nH]1)C(F)(F)F