Reaction Details
TargetMineralocorticoid receptor
LigandBDBM50326935
Substrate/Competitorn/a
Meas. Tech.ChEMBL_663370 (CHEMBL1250866)
IC50 220±n/a nM
Citation Riether, DHarcken, CRazavi, HKuzmich, DGilmore, TBentzien, JPack, EJSouza, DNelson, RMKukulka, AFadra, TNZuvela-Jelaska, LPelletier, JDinallo, RPanzenbeck, MTorcellini, CNabozny, GHThomson, DS Nonsteroidal dissociated glucocorticoid agonists containing azaindoles as steroid A-ring mimetics. J Med Chem53:6681-98 (2010) 
 
Mineralocorticoid receptor
Name:Mineralocorticoid receptor
Type:Enzyme
Mol. Mass.:107076.42
Organism:Homo sapiens (Human)
Description:P08235
Residue:984
BDBM50326935
NameBDBM50326935
Synonyms:1,1,1-trifluoro-4-(5-fluoro-2-methoxyphenyl)-4-methyl-2-(thieno[2,3-c]pyridin-2-ylmethyl)pentan-2-ol | CHEMBL1254907
TypeSmall organic molecule
Emp. Form.C21H21F4NO2S
Mol. Mass.427.456
SMILESCOc1ccc(F)cc1C(C)(C)CC(O)(Cc1cc2ccncc2s1)C(F)(F)F