Reaction Details
TargetMineralocorticoid receptor
LigandBDBM50326940
Substrate/Competitorn/a
Meas. Tech.ChEMBL_663370 (CHEMBL1250866)
IC50>2000±n/a nM
Citation Riether, DHarcken, CRazavi, HKuzmich, DGilmore, TBentzien, JPack, EJSouza, DNelson, RMKukulka, AFadra, TNZuvela-Jelaska, LPelletier, JDinallo, RPanzenbeck, MTorcellini, CNabozny, GHThomson, DS Nonsteroidal dissociated glucocorticoid agonists containing azaindoles as steroid A-ring mimetics. J Med Chem53:6681-98 (2010) 
 
Mineralocorticoid receptor
Name:Mineralocorticoid receptor
Type:Enzyme
Mol. Mass.:107076.42
Organism:Homo sapiens (Human)
Description:P08235
Residue:984
BDBM50326940
NameBDBM50326940
Synonyms:1,1,1-Trifluoro-4-(5-fluoro-2-methoxyphenyl)-4-methyl-2-pyrazolo[1,5-a]pyridin-2-ylmethylpentan-2-ol | CHEMBL1255079
TypeSmall organic molecule
Emp. Form.C21H22F4N2O2
Mol. Mass.410.4052
SMILESCOc1ccc(F)cc1C(C)(C)CC(O)(Cc1cc2ccccn2n1)C(F)(F)F