Reaction Details
TargetProgesterone receptor
LigandBDBM50326948
Substrate/Competitorn/a
Meas. Tech.ChEMBL_663369 (CHEMBL1250865)
IC50 1900±n/a nM
Citation Riether, DHarcken, CRazavi, HKuzmich, DGilmore, TBentzien, JPack, EJSouza, DNelson, RMKukulka, AFadra, TNZuvela-Jelaska, LPelletier, JDinallo, RPanzenbeck, MTorcellini, CNabozny, GHThomson, DS Nonsteroidal dissociated glucocorticoid agonists containing azaindoles as steroid A-ring mimetics. J Med Chem53:6681-98 (2010) 
 
Progesterone receptor
Name:Progesterone receptor
Type:Protein
Mol. Mass.:98979.52
Organism:Homo sapiens (Human)
Description:P06401
Residue:933
BDBM50326948
NameBDBM50326948
Synonyms:4-Fluoro-2-[(R)-4,4,4-trifluoro-3-hydroxy-1,1-dimethyl-3-(1H-pyrrolo[3,2-c]pyridin-2-ylmethyl)butyl]phenol | CHEMBL1253899
TypeSmall organic molecule
Emp. Form.C20H20F4N2O2
Mol. Mass.396.3786
SMILESCC(C)(C[C@@](O)(Cc1cc2cnccc2[nH]1)C(F)(F)F)c1cc(F)ccc1O