Reaction Details
Target5-hydroxytryptamine receptor 1B
LigandBDBM50327234
Substrate/Competitorn/a
Meas. Tech.ChEMBL_664293 (CHEMBL1259328)
Ki 1571±n/a nM
Citation Reynolds, AHanani, RHibbs, DDamont, ADa Pozzo, ESelleri, SDollé, FMartini, CKassiou, M Pyrazolo[1,5-a]pyrimidine acetamides: 4-Phenyl alkyl ether derivatives as potent ligands for the 18 kDa translocator protein (TSPO). Bioorg Med Chem Lett20:5799-802 (2010) 
 
5-hydroxytryptamine receptor 1B
Name:5-hydroxytryptamine receptor 1B
Type:G Protein-Coupled Receptor (GPCR)
Mol. Mass.:43579.17
Organism:Homo sapiens (Human)
Description:Receptor binding assays were performed using human clone stably expressed in CHO cells
Residue:390
BDBM50327234
NameBDBM50327234
Synonyms:2-[2-(4'-Butoxy1phenyl)-5,7-dimethylpyrazolo[1,5-a]pyrimidin-3-yl)-N,N-diethylacetamide | CHEMBL1258723
TypeSmall organic molecule
Emp. Form.C24H32N4O2
Mol. Mass.408.5365
SMILESCCCCOc1ccc(cc1)-c1nn2c(C)cc(C)nc2c1CC(=O)N(CC)CC