Reaction Details
TargetCoagulation factor X
LigandBDBM50140363
Substrate/Competitorn/a
Meas. Tech.ChEMBL_675275 (CHEMBL1273257)
Ki 1.5±n/a nM
Citation Pinto, DJSmallheer, JMCheney, DLKnabb, RMWexler, RR Factor Xa inhibitors: next-generation antithrombotic agents. J Med Chem53:6243-74 (2010) 
 
Coagulation factor X
Name:Coagulation factor X
Type:Enzyme
Mol. Mass.:54726.60
Organism:Homo sapiens (Human)
Description:n/a
Residue:488
BDBM50140363
NameBDBM50140363
Synonyms:2-(6-Chloro-naphthalen-2-yl)-5-methyl-2H-pyrazole-3-carboxylic acid [4-(2-dimethylaminomethyl-imidazol-1-yl)-2-fluoro-phenyl]-amide | CHEMBL279287
TypeSmall organic molecule
Emp. Form.C27H24ClFN6O
Mol. Mass.502.97
SMILESCN(C)Cc1nccn1-c1ccc(NC(=O)c2cc(C)nn2-c2ccc3cc(Cl)ccc3c2)c(F)c1