Reaction Details
TargetProthrombin
LigandBDBM12657
Substrate/Competitorn/a
Meas. Tech.ChEMBL_675277 (CHEMBL1273259)
Ki 6000±n/a nM
Citation Pinto, DJSmallheer, JMCheney, DLKnabb, RMWexler, RR Factor Xa inhibitors: next-generation antithrombotic agents. J Med Chem53:6243-74 (2010) 
 
Prothrombin
Name:Prothrombin
Type:Protein
Mol. Mass.:70029.57
Organism:Homo sapiens (Human)
Description:P00734
Residue:622
BDBM12657
NameBDBM12657
Synonyms:1-[3-(Aminomethyl)phenyl]-N-[3-fluoro-2-(methylsulfonyl)-[1,1-biphenyl]-4-yl]-3-(trifluoromethyl)-1H-pyrazole-5-carboxamide CHEMBL559015 DPC423
TypeSmall organic molecule
Emp. Form.C25H20F4N4O3S
Mol. Mass.532.51
SMILESCS(=O)(=O)c1ccccc1-c1ccc(NC(=O)c2cc(nn2-c2cccc(CN)c2)C(F)(F)F)c(F)c1