Reaction Details
TargetSerine/threonine-protein kinase Nek6
LigandBDBM50329915
Substrate/Competitorn/a
Meas. Tech.ChEMBL_675885 (CHEMBL1272702)
IC50 595±n/a nM
Citation Beria, IValsasina, BBrasca, MGCeccarelli, WColombo, MCribioli, SFachin, GFerguson, RDFiorentini, FGianellini, LMGiorgini, MLMoll, JKPosteri, HPezzetta, DRoletto, FSola, FTesei, DCaruso, M 4,5-Dihydro-1H-pyrazolo[4,3-h]quinazolines as potent and selective Polo-like kinase 1 (PLK1) inhibitors. Bioorg Med Chem Lett20:6489-94 (2010) 
 
Serine/threonine-protein kinase Nek6
Name:Serine/threonine-protein kinase Nek6
Type:PROTEIN
Mol. Mass.:35724.53
Organism:Homo sapiens (Human)
Description:ChEMBL_1446777
Residue:313
BDBM50329915
NameBDBM50329915
Synonyms:1-methyl-8-(5-(piperazin-1-yl)-2-(trifluoromethoxy)phenylamino)-4,5-dihydro-1H-pyrazolo[4,3-h]quinazoline-3-carboxamide | CHEMBL1271644
TypeSmall organic molecule
Emp. Form.C22H23F3N8O2
Mol. Mass.488.4656
SMILESCn1nc(C(N)=O)c2CCc3cnc(Nc4cc(ccc4OC(F)(F)F)N4CCNCC4)nc3-c12