Reaction Details
TargetSerine/threonine-protein kinase Nek6
LigandBDBM50329929
Substrate/Competitorn/a
Meas. Tech.ChEMBL_675885 (CHEMBL1272702)
IC50 336±n/a nM
Citation Beria, IValsasina, BBrasca, MGCeccarelli, WColombo, MCribioli, SFachin, GFerguson, RDFiorentini, FGianellini, LMGiorgini, MLMoll, JKPosteri, HPezzetta, DRoletto, FSola, FTesei, DCaruso, M 4,5-Dihydro-1H-pyrazolo[4,3-h]quinazolines as potent and selective Polo-like kinase 1 (PLK1) inhibitors. Bioorg Med Chem Lett20:6489-94 (2010) 
 
Serine/threonine-protein kinase Nek6
Name:Serine/threonine-protein kinase Nek6
Type:PROTEIN
Mol. Mass.:35724.53
Organism:Homo sapiens (Human)
Description:ChEMBL_1446777
Residue:313
BDBM50329929
NameBDBM50329929
Synonyms:8-(5-(piperazin-1-yl)-2-(trifluoromethoxy)phenylamino)-1-vinyl-4,5-dihydro-1H-pyrazolo[4,3-h]quinazoline-3-carboxamide | CHEMBL1271870
TypeSmall organic molecule
Emp. Form.C24H25F3N8O2
Mol. Mass.514.5029
SMILESCN1CCN(CC1)c1ccc(OC(F)(F)F)c(Nc2ncc3CCc4c(nn(C=C)c4-c3n2)C(N)=O)c1