Reaction Details
TargetPeptidyl-prolyl cis-trans isomerase B
LigandBDBM50330193
Substrate/Competitorn/a
Meas. Tech.ChEMBL_676204 (CHEMBL1273324)
IC50 28.9±n/a nM
Citation Scribner, AHouck, DHuang, ZMosier, SPeel, MScorneaux, B Synthesis and biological evaluation of [D-lysine]8cyclosporin A analogs as potential anti-HCV agents. Bioorg Med Chem Lett20:6542-6 (2010) 
 
Peptidyl-prolyl cis-trans isomerase B
Name:Peptidyl-prolyl cis-trans isomerase B
Type:Protein
Mol. Mass.:23751.82
Organism:Homo sapiens (Human)
Description:P23284
Residue:216
BDBM50330193
NameBDBM50330193
Synonyms:(3S,6S,9S,12R,15S,18S,21S,24S,30S,33S)-12-(3-(dimethylamino)propyl)-30-ethyl-33-((1R,2R)-1-hydroxy-2-methylhex-4-enyl)-6,9,18,24-tetraisobutyl-3,21-diisopropyl-1,4,7,10,15,19,25,28-octamethyl-1,4,7,10,13,16,19,22,25,28,31-undecaazacyclotritriacontan-2,5,8,11,14,17,20,23,26,29,32-undecaone | CHEMBL1269591
TypeSmall organic molecule
Emp. Form.C66H120N12O12
Mol. Mass.1273.7322
SMILESCC[C@@H]1NC(=O)[C@H]([C@H](O)[C@H](C)C\C=C\C)N(C)C(=O)[C@H](C(C)C)N(C)C(=O)[C@H](CC(C)C)N(C)C(=O)[C@H](CC(C)C)N(C)C(=O)[C@@H](CCCN(C)C)NC(=O)[C@H](C)NC(=O)[C@H](CC(C)C)N(C)C(=O)[C@@H](NC(=O)[C@H](CC(C)C)N(C)C(=O)CN(C)C1=O)C(C)C