Reaction Details
TargetSialidase-1
LigandBDBM4706
Substrate/Competitorn/a
Meas. Tech.ChEMBL_679987 (CHEMBL1280935)
IC50 168000±n/a nM
Citation Hata, KKoseki, KYamaguchi, KMoriya, SSuzuki, YYingsakmongkon, SHirai, GSodeoka, Mvon Itzstein, MMiyagi, T Limited inhibitory effects of oseltamivir and zanamivir on human sialidases. Antimicrob Agents Chemother52:3484-91 (2008) 
 
Sialidase-1
Name:Sialidase-1
Type:PROTEIN
Mol. Mass.:45463.28
Organism:Homo sapiens (Human)
Description:ChEMBL_960639
Residue:415
BDBM4706
NameBDBM4706
Synonyms:(2R,3R,4S)-3-acetamido-4-hydroxy-2-[(1R,2R)-1,2,3-trihydroxypropyl]-3,4-dihydro-2H-pyran-6-carboxylic acid CHEMBL96712 Neu5Ac2en
TypeSmall organic molecule
Emp. Form.C11H17NO8
Mol. Mass.291.2546
SMILESCC(=O)N[C@@H]1[C@@H](O)C=C(O[C@H]1[C@H](O)[C@H](O)CO)C(O)=O