Reaction Details
Target5-hydroxytryptamine receptor 3A
LigandBDBM50330471
Substrate/Competitorn/a
Meas. Tech.ChEMBL_684849 (CHEMBL1286079)
IC50>100±n/a nM
Citation Asagarasu, AMatsui, THayashi, HTamaoki, SYamauchi, YMinato, KSato, M Discovery of a novel 5-HT(3) antagonist/5-HT(1A) agonist 3-amino-5,6,7,8-tetrahydro-2-{4-[4-(quinolin-2-yl)piperazin-1-yl]butyl}quinazolin-4(3H)-one (TZB-30878) as an orally bioavailable agent for irritable bowel syndrome. J Med Chem53:7549-63 (2010) 
 
5-hydroxytryptamine receptor 3A
Name:5-hydroxytryptamine receptor 3A
Type:Protein
Mol. Mass.:55283.27
Organism:Homo sapiens (Human)
Description:P46098
Residue:478
BDBM50330471
NameBDBM50330471
Synonyms:3-Amino-2-[4-[4-(6-hydroxyquinolin-2-yl)piperazin-1-yl]butyl]-5,6,7,8-tetrahydro-3H-quinazolin-4-one | CHEMBL1277283
TypeSmall organic molecule
Emp. Form.C25H32N6O2
Mol. Mass.448.5606
SMILESNn1c(CCCCN2CCN(CC2)c2ccc3cc(O)ccc3n2)nc2CCCCc2c1=O