Reaction Details
Target5-hydroxytryptamine receptor 1A
LigandBDBM50330445
Substrate/Competitorn/a
Meas. Tech.ChEMBL_684851 (CHEMBL1286081)
EC50 2.5±n/a nM
Citation Asagarasu, AMatsui, THayashi, HTamaoki, SYamauchi, YMinato, KSato, M Discovery of a novel 5-HT(3) antagonist/5-HT(1A) agonist 3-amino-5,6,7,8-tetrahydro-2-{4-[4-(quinolin-2-yl)piperazin-1-yl]butyl}quinazolin-4(3H)-one (TZB-30878) as an orally bioavailable agent for irritable bowel syndrome. J Med Chem53:7549-63 (2010) 
 
5-hydroxytryptamine receptor 1A
Name:5-hydroxytryptamine receptor 1A
Type:n/a
Mol. Mass.:46122.49
Organism:Homo sapiens (Human)
Description:n/a
Residue:422
BDBM50330445
NameBDBM50330445
Synonyms:7-Acetyl-3-amino-2-[3-(4-quinolin-2-ylpiperazin-1-yl)propylthio]-5,6,7,8-tetrahydro-3H-pyrido[4',3':4,5]thieno[2,3-d]pyridin-4-one | CHEMBL1277558
TypeSmall organic molecule
Emp. Form.C27H31N7O2S2
Mol. Mass.549.711
SMILESCC(=O)N1CCc2c(C1)sc1nc(SCCCN3CCN(CC3)c3ccc4ccccc4n3)n(N)c(=O)c21