Reaction Details
Target5-hydroxytryptamine receptor 1A
LigandBDBM50330446
Substrate/Competitorn/a
Meas. Tech.ChEMBL_684850 (CHEMBL1286080)
IC50 4.2±n/a nM
Citation Asagarasu, AMatsui, THayashi, HTamaoki, SYamauchi, YMinato, KSato, M Discovery of a novel 5-HT(3) antagonist/5-HT(1A) agonist 3-amino-5,6,7,8-tetrahydro-2-{4-[4-(quinolin-2-yl)piperazin-1-yl]butyl}quinazolin-4(3H)-one (TZB-30878) as an orally bioavailable agent for irritable bowel syndrome. J Med Chem53:7549-63 (2010) 
 
5-hydroxytryptamine receptor 1A
Name:5-hydroxytryptamine receptor 1A
Type:n/a
Mol. Mass.:46122.49
Organism:Homo sapiens (Human)
Description:n/a
Residue:422
BDBM50330446
NameBDBM50330446
Synonyms:3-Amino-5,6-dimethyl-2-[3-(4-pyridin-2-ylpiperazin-1-yl)propylthio]-3H-thieno[2,3-d]pyrimidin-4-one | CHEMBL1278174
TypeSmall organic molecule
Emp. Form.C20H26N6OS2
Mol. Mass.430.59
SMILESCc1sc2nc(SCCCN3CCN(CC3)c3ccccn3)n(N)c(=O)c2c1C