Reaction Details
Target5-hydroxytryptamine receptor 1A
LigandBDBM50330447
Substrate/Competitorn/a
Meas. Tech.ChEMBL_684850 (CHEMBL1286080)
IC50 4.3±n/a nM
Citation Asagarasu, AMatsui, THayashi, HTamaoki, SYamauchi, YMinato, KSato, M Discovery of a novel 5-HT(3) antagonist/5-HT(1A) agonist 3-amino-5,6,7,8-tetrahydro-2-{4-[4-(quinolin-2-yl)piperazin-1-yl]butyl}quinazolin-4(3H)-one (TZB-30878) as an orally bioavailable agent for irritable bowel syndrome. J Med Chem53:7549-63 (2010) 
 
5-hydroxytryptamine receptor 1A
Name:5-hydroxytryptamine receptor 1A
Type:n/a
Mol. Mass.:46122.49
Organism:Homo sapiens (Human)
Description:n/a
Residue:422
BDBM50330447
NameBDBM50330447
Synonyms:3-Amino-5,6-dimethyl-2-[3-[4-(4-methylquinolin-2-yl)piperazin-1-yl]propylthio]-3H-thieno[2,3-d]pyrimidin-4-one | CHEMBL1276833
TypeSmall organic molecule
Emp. Form.C25H30N6OS2
Mol. Mass.494.675
SMILESCc1sc2nc(SCCCN3CCN(CC3)c3cc(C)c4ccccc4n3)n(N)c(=O)c2c1C