Reaction Details
Target5-hydroxytryptamine receptor 3A
LigandBDBM50330466
Substrate/Competitorn/a
Meas. Tech.ChEMBL_684849 (CHEMBL1286079)
IC50 48.3±n/a nM
Citation Asagarasu, AMatsui, THayashi, HTamaoki, SYamauchi, YMinato, KSato, M Discovery of a novel 5-HT(3) antagonist/5-HT(1A) agonist 3-amino-5,6,7,8-tetrahydro-2-{4-[4-(quinolin-2-yl)piperazin-1-yl]butyl}quinazolin-4(3H)-one (TZB-30878) as an orally bioavailable agent for irritable bowel syndrome. J Med Chem53:7549-63 (2010) 
 
5-hydroxytryptamine receptor 3A
Name:5-hydroxytryptamine receptor 3A
Type:Protein
Mol. Mass.:55283.27
Organism:Homo sapiens (Human)
Description:P46098
Residue:478
BDBM50330466
NameBDBM50330466
Synonyms:3-Amino-6-methyl-2-[4-(4-quinolin-2-ylpiperazin-1-yl)butyl]-5, 6,7,8-tetrahydro-3H-quinazolin-4-one | CHEMBL1278175
TypeSmall organic molecule
Emp. Form.C26H34N6O
Mol. Mass.446.5878
SMILESCC1CCc2nc(CCCCN3CCN(CC3)c3ccc4ccccc4n3)n(N)c(=O)c2C1