Reaction Details
Target5-hydroxytryptamine receptor 3A
LigandBDBM50330448
Substrate/Competitorn/a
Meas. Tech.ChEMBL_684849 (CHEMBL1286079)
IC50 100±n/a nM
Citation Asagarasu, AMatsui, THayashi, HTamaoki, SYamauchi, YMinato, KSato, M Discovery of a novel 5-HT(3) antagonist/5-HT(1A) agonist 3-amino-5,6,7,8-tetrahydro-2-{4-[4-(quinolin-2-yl)piperazin-1-yl]butyl}quinazolin-4(3H)-one (TZB-30878) as an orally bioavailable agent for irritable bowel syndrome. J Med Chem53:7549-63 (2010) 
 
5-hydroxytryptamine receptor 3A
Name:5-hydroxytryptamine receptor 3A
Type:Protein
Mol. Mass.:55283.27
Organism:Homo sapiens (Human)
Description:P46098
Residue:478
BDBM50330448
NameBDBM50330448
Synonyms:3-Amino-2-[3-(4-quinolin-2-ylpiperazin-1-yl)propylthio]-5,6,7, 8-tetrahydro-3H-pyrido[4',3':4,5]thieno[2,3-d]pyridin-4-one | CHEMBL1277463
TypeSmall organic molecule
Emp. Form.C25H29N7OS2
Mol. Mass.507.674
SMILESNn1c(SCCCN2CCN(CC2)c2ccc3ccccc3n2)nc2sc3CNCCc3c2c1=O