Reaction Details
TargetIsoform 4 of Lethal(3)malignant brain tumor-like protein 1 (4)
LigandBDBM50330501
Substrate/Competitorn/a
Meas. Tech.ChEMBL_684948 (CHEMBL1286363)
IC50>100000±n/a nM
Citation Kireev, DWigle, TJNorris-Drouin, JHerold, JMJanzen, WPFrye, SV Identification of non-peptide malignant brain tumor (MBT) repeat antagonists by virtual screening of commercially available compounds. J Med Chem53:7625-31 (2010) 
 
Isoform 4 of Lethal(3)malignant brain tumor-like protein 1 (4)
Name:Isoform 4 of Lethal(3)malignant brain tumor-like protein 1 (4)
Type:Protein
Mol. Mass.:83871.06
Organism:Homo sapiens (Human)
Description:Q9Y468-4
Residue:752
BDBM50330501
NameBDBM50330501
Synonyms:4-(2-methoxy-4-methylphenoxy)-N-methylbutan-1-amine | CHEMBL1275705
TypeSmall organic molecule
Emp. Form.C13H21NO2
Mol. Mass.223.3113
SMILESCNCCCCOc1ccc(C)cc1OC