Reaction Details
TargetCannabinoid receptor 1
LigandBDBM50330770
Substrate/Competitorn/a
Meas. Tech.ChEMBL_685384 (CHEMBL1287584)
Ki>10000±n/a nM
Citation Huffman, JWHepburn, SALyutenko, NThompson, ALWiley, JLSelley, DEMartin, BR 1-Bromo-3-(1',1'-dimethylalkyl)-1-deoxy-¿(8)-tetrahydrocannabinols: New selective ligands for the cannabinoid CB(2) receptor. Bioorg Med Chem18:7809-15 (2010) 
 
Cannabinoid receptor 1
Name:Cannabinoid receptor 1
Type:G Protein-Coupled Receptor (GPCR)
Mol. Mass.:52856.55
Organism:Rattus norvegicus (rat)
Description:P20272
Residue:473
BDBM50330770
NameBDBM50330770
Synonyms:(6aR,10aR)-1-bromo-6,6,9-trimethyl-3-(2-methylpentan-2-yl)-6a,7,10,10a-tetrahydro-6H-benzo[c]chromene | CHEMBL1277498
TypeSmall organic molecule
Emp. Form.C22H31BrO
Mol. Mass.391.385
SMILESCCCC(C)(C)c1cc(Br)c2[C@@H]3CC(C)=CC[C@H]3C(C)(C)Oc2c1